{"text_format":"1","workbook":"xlsx","n_sheets":6,"sheets":["ВОРОНКА","ДИНАМИКА","МОДЕЛИРОВАНИЕ","БАЗА КЛИЕНТОВ","СТАТИСТИКА БАЗЫ","СПРАВОЧНИК"],"not_rendered":{"charts":38,"images":22,"macros":1,"external_links":0,"defined_names":41,"comments":4,"pivot_tables":0},"unopened":[],"bounds":{"document_bytes":16777216,"sheet_cells":100000,"rows_first":2000,"rows_last":500,"rows_between":2000,"halvings":0,"cell_chars":16384,"cell_head_chars":4096},"cells_cut":0,"cells_raw":0,"read":"whole","date_system":"1900"}

{"sheet":"ВОРОНКА","index":0,"n_rows":1048,"n_cols":38,"rows_kept":1048,"cut":false,"hidden":false,"merged":[[105,19,105,21],[975,19,975,21],[977,19,977,21],[12,19,12,21],[14,19,14,21],[16,19,16,21],[18,19,18,21],[17,19,17,21],[15,19,15,21],[13,19,13,21],[185,19,185,21],[186,19,186,21],[187,19,187,21],[188,19,188,21],[189,19,189,21],[190,19,190,21],[191,19,191,21],[194,19,194,21],[366,19,366,21],[368,19,368,21],[627,19,627,21],[629,19,629,21],[803,19,803,21],[801,19,801,21],[880,18,886,18],[880,23,882,24],[883,22,885,24],[886,22,888,24],[890,19,890,21],[967,18,973,18],[967,23,969,24],[970,22,972,24],[973,22,975,24],[881,19,881,21],[882,19,882,21],[883,19,883,21],[884,19,884,21],[885,19,885,21],[886,19,886,21],[887,19,887,21],[888,19,888,21],[968,19,968,21],[969,19,969,21],[970,19,970,21],[971,19,971,21],[972,19,972,21],[973,19,973,21],[974,19,974,21],[706,18,712,18],[706,23,708,24],[709,22,711,24],[712,22,714,24],[716,19,716,21],[793,18,799,18],[793,23,795,24],[796,22,798,24],[799,22,801,24],[707,19,707,21],[708,19,708,21],[709,19,709,21],[710,19,710,21],[711,19,711,21],[712,19,712,21],[713,19,713,21],[714,19,714,21],[794,19,794,21],[795,19,795,21],[796,19,796,21],[797,19,797,21],[798,19,798,21],[799,19,799,21],[800,19,800,21],[532,18,538,18],[532,23,534,24],[535,22,537,24],[538,22,540,24],[542,19,542,21],[619,18,625,18],[619,23,621,24],[622,22,624,24],[625,22,627,24],[533,19,533,21],[534,19,534,21],[535,19,535,21],[536,19,536,21],[537,19,537,21],[538,19,538,21],[539,19,539,21],[540,19,540,21],[620,19,620,21],[621,19,621,21],[622,19,622,21],[623,19,623,21],[624,19,624,21],[625,19,625,21],[626,19,626,21],[445,18,451,18],[445,23,447,24],[448,22,450,24],[451,22,453,24],[455,19,455,21],[446,19,446,21],[447,19,447,21],[448,19,448,21],[449,19,449,21],[450,19,450,21],[451,19,451,21],[452,19,452,21],[453,19,453,21],[271,18,277,18],[271,23,273,24],[274,22,276,24],[277,22,279,24],[281,19,281,21],[358,18,364,18],[358,23,360,24],[361,22,363,24],[364,22,366,24],[272,19,272,21],[273,19,273,21],[274,19,274,21],[275,19,275,21],[276,19,276,21],[277,19,277,21],[278,19,278,21],[279,19,279,21],[359,19,359,21],[360,19,360,21],[361,19,361,21],[362,19,362,21],[363,19,363,21],[364,19,364,21],[365,19,365,21],[10,18,16,18],[20,19,20,21],[4,24,4,25],[97,18,103,18],[97,23,99,24],[100,22,102,24],[103,22,105,24],[107,19,107,21],[184,18,190,18],[184,23,186,24],[187,22,189,24],[190,22,192,24],[192,19,192,21],[10,23,12,24],[13,22,15,24],[16,22,18,24],[11,19,11,21],[98,19,98,21],[99,19,99,21],[100,19,100,21],[101,19,101,21],[102,19,102,21],[103,19,103,21],[104,19,104,21],[3,1,4,1],[27,0,28,0],[10,0,11,0],[44,0,45,0],[61,0,62,0],[78,0,79,0],[445,0,446,0],[462,0,463,0],[479,0,480,0],[426,0,427,0],[97,0,98,0],[114,0,115,0],[131,0,132,0],[148,0,149,0],[165,0,166,0],[184,0,185,0],[201,0,202,0],[218,0,219,0],[235,0,236,0],[252,0,253,0],[271,0,272,0],[288,0,289,0],[305,0,306,0],[322,0,323,0],[827,0,828,0],[844,0,845,0],[496,0,497,0],[513,0,514,0],[670,0,671,0],[687,0,688,0],[532,0,533,0],[549,0,550,0],[566,0,567,0],[583,0,584,0],[600,0,601,0],[636,0,637,0],[653,0,654,0],[619,0,620,0],[3,18,3,19],[861,0,862,0],[706,0,707,0],[723,0,724,0],[740,0,741,0],[757,0,758,0],[774,0,775,0],[1035,0,1036,0],[880,0,881,0],[897,0,898,0],[914,0,915,0],[931,0,932,0],[948,0,949,0],[967,0,968,0],[984,0,985,0],[1001,0,1002,0],[1018,0,1019,0],[339,0,340,0],[358,0,359,0],[375,0,376,0],[392,0,393,0],[409,0,410,0],[793,0,794,0],[810,0,811,0]]}
[]
[null,null,"Продукт защищен авторским правом. Все права принадлежат автору. Незаконное распространение запрещено и преследуется по закону.",null,null,null,null,null,null,null,null,null,null,null,null,null,null,null,null,null,null,1,{"$f":"VLOOKUP(V2,СПРАВОЧНИК!$A:$I,9,0)","v":"Месяц"},null,null,null,null,null,3,{"$f":"VLOOKUP(AC2,СПРАВОЧНИК!$A:$C,3,0)","v":"Заходы-продажи"},null,null,null,null,null,null,3,{"$f":"VLOOKUP(AK2,СПРАВОЧНИК!$A:$F,6,0)","v":"Прибыль  (- реклама)"}]
[null,null,"Автор: Евгений Новиков (vk.com/truejacko)",null,null,"mail: evgeny.novikov@mail.ru",null,null,null,"Официальное сообщество: ",null,"vk.com/voronkaprodazh"]
[null,"Воронка продаж 4.0 (продвинутая версия)","Каналы, ведущие на сайт",null,null,null,null,null,null,null,null,"Продающие каналы, не ведущие на сайт",null,null,null,null,null,null,"Доп.расходы"]
[null,null,"прямые заходы","директ","adwords","поиск","ссылки","источник n",". . .","Итого сайт",null,"Повторные","Вконтакте",". . . .","Итого площадки",null,"Итого по каналам",null,"Описание","Сумма, руб.",null,"Период:",null,null,"Показывать на графиках:"]
[null,"ЯНВАРЬ",{"$f":"IF(Q23=0,\"              \",\"Чистая прибыль: \")&IF(Q23=0,\"\",Q23)&\"          \"&IF(Q13=\"\",\"                  \",\"Затраты на рекламу: \")&IF(Q13=\"\",\"\",Q13)&\"          \"&IF(T23=0,\"\",\"Доп.расходы: \")&IF(T23=0,\"\",T23)","v":"                                                    "}]
[null,"Итого за месяц","Дней:",{"$f":"SUM(D24,D41,D58,D75)","v":31}]
[null,"Показов",{"$f":"SUM(C25,C42,C59,C76)","v":0},{"$f":"SUM(D25,D42,D59,D76)","v":0},0,0,null,0,0,{"$f":"IF(SUM(C8:I8)=0,\"\",SUM(C8:I8))","v":""},null,{"$f":"SUM(L25,L42,L59,L76)","v":0},0,0,{"$f":"IF(SUM(L8:N8)=0,\"\",SUM(L8:N8))","v":""},null,{"$f":"IF(SUM(J8,O8)=0,\"\",SUM(J8,O8))","v":""},null,null,null,null,null,null,null,null,null,"нед.1","нед.2","нед.3","нед.4"]
{"$rows_left_out":1041}
{"sheet":"ДИНАМИКА","index":1,"n_rows":41,"n_cols":55,"rows_kept":41,"cut":false,"hidden":false,"merged":[[1,22,1,23],[2,22,2,23],[1,19,1,21],[1,24,1,25],[2,24,2,25],[2,19,2,21],[1,37,1,38],[1,39,1,41],[2,37,2,38],[2,39,2,41],[1,26,1,28],[2,26,2,28],[38,15,38,16],[40,15,40,16],[11,15,17,16],[9,15,9,28],[21,15,27,16],[31,15,36,16],[30,15,30,28],[20,15,20,28],[10,15,10,28],[18,15,18,16],[28,15,28,16],[8,48,8,54],[20,30,20,41],[30,30,30,41],[9,43,9,54],[10,43,10,54],[20,43,20,54],[30,43,30,54],[9,30,9,41],[10,30,10,41]]}
[1,null,{"$f":"IF(OFFSET(ВОРОНКА!$D26,($A$1-1)*87,0,1,1)>0,OFFSET(ВОРОНКА!$D24,($A$1-1)*87,0,1,1),0)","v":0},{"$f":"IF(OFFSET(ВОРОНКА!$D43,($A$1-1)*87,0,1,1)>0,OFFSET(ВОРОНКА!$D41,($A$1-1)*87,0,1,1),0)","v":0},{"$f":"IF(OFFSET(ВОРОНКА!$D60,($A$1-1)*87,0,1,1)>0,OFFSET(ВОРОНКА!$D58,($A$1-1)*87,0,1,1),0)","v":0},{"$f":"IF(OFFSET(ВОРОНКА!$D77,($A$1-1)*87,0,1,1)>0,OFFSET(ВОРОНКА!$D75,($A$1-1)*87,0,1,1),0)","v":0},null,null,180,1.8,1.8,null,null,null,null,"ПОСТРОЕНИЕ ПРОГНОЗА И СРАВНЕНИЕ С ЦЕЛЬЮ:",null,null,null,null,null,null,null,null,null,null,null,null,null,null,null,null,null,null,null,null,null,1,null,null,null,null,null,null,null,null,null,null,null,null,"Янв","Фев","Мар"]
[null,null,"нед.1","нед.2","нед.3","нед.4",null,null,45,{"$f":"180%*AA3","v":{"$error":"#VALUE!"}},{"$f":"180%*IF(AN3>1,1,AN3)","v":1.8},null,null,null,null,"Выберите месяц:",null,null,null,"Показатель",null,null,"Факт",null,"Цель",null,"факт vs цель, %",null,null,null,null,null,null,null,null,null,null,"Прогноз",null,"прогноз vs цель, %"]
[null,null,{"$f":"OFFSET(ВОРОНКА!$Q40,($A$1-1)*87,0,1,1)","v":0},{"$f":"OFFSET(ВОРОНКА!$Q57,($A$1-1)*87,0,1,1)","v":0},{"$f":"OFFSET(ВОРОНКА!$Q74,($A$1-1)*87,0,1,1)","v":0},{"$f":"OFFSET(ВОРОНКА!$Q91,($A$1-1)*87,0,1,1)","v":0},null,null,45,0.03,0.03,null,null,null,null,null,null,null,null,"Чистая прибыль",null,null,{"$f":"OFFSET(ВОРОНКА!$Q23,($A$1-1)*87,0,1,1)","v":0},null,{"$f":"IF(A1=1,AY2,IF(A1=2,AZ2,IF(A1=3,BA2,IF(A1=4,AY4,IF(A1=5,AZ4,IF(A1=6,BA4,IF(A1=7,AY6,IF(A1=8,AZ6,IF(A1=9,BA6,IF(A1=10,AY8,IF(A1=11,AZ8,BA8)))))))))))","v":0},null,{"$f":"IFERROR(W3/Y3,\"\")","v":""},null,null,null,null,null,null,null,null,null,null,{"$f":"IF(AL1=1,МОДЕЛИРОВАНИЕ!$AE$14,IF(AL1=2,МОДЕЛИРОВАНИЕ!$AK$14,МОДЕЛИРОВАНИЕ!$AQ$14))","v":""},null,{"$f":"IFERROR(AL3/Y3,\"\")","v":""},null,null,null,null,null,null,null,null,null,null,"Апр","Май","Июн"]
[null,null,null,null,null,null,null,null,45,{"$f":"180%-J2","v":{"$error":"#VALUE!"}},{"$f":"180%-K2","v":0}]
[null,null,null,null,null,null,null,null,45,null,null,null,null,null,null,null,null,null,null,null,null,null,null,null,null,null,null,null,null,null,null,null,null,null,null,null,null,null,null,null,null,null,null,null,null,null,null,null,null,null,"Июл","Авг","Сен"]
[]
[null,null,null,null,null,null,null,null,null,null,null,null,null,null,null,null,null,null,null,null,null,null,null,null,null,null,null,null,null,null,null,null,null,null,null,null,null,null,null,null,null,null,null,null,null,null,null,null,null,null,"Окт","Ноя","Дек"]
[]
{"$rows_left_out":34}
{"sheet":"МОДЕЛИРОВАНИЕ","index":2,"n_rows":39,"n_cols":43,"rows_kept":39,"cut":false,"hidden":false,"merged":[[2,12,2,20],[3,14,3,15],[4,19,4,20],[5,19,5,20],[6,19,6,20],[7,19,7,20],[8,19,8,20],[9,19,9,20],[11,19,11,20],[10,19,10,20],[3,16,3,20],[4,14,4,15],[6,14,6,15],[7,14,7,15],[8,14,8,15],[9,14,9,15],[10,14,10,15],[11,14,11,15],[3,12,3,13],[4,12,4,13],[7,12,7,13],[6,12,6,13],[5,12,5,13],[3,4,3,5],[4,4,4,5],[3,8,3,9],[4,8,4,9],[8,8,8,9],[11,8,11,9],[11,4,11,5],[13,4,13,5],[3,6,3,7],[4,6,4,7],[5,6,5,7],[6,6,6,7],[7,6,7,7],[8,6,8,7],[9,6,9,7],[11,6,11,7],[13,6,13,7],[5,4,5,5],[6,4,6,5],[37,22,37,23],[25,18,25,27],[24,18,24,22],[33,23,34,23],[14,21,14,27],[33,17,34,17],[27,19,27,22],[28,20,28,22],[29,21,29,22],[30,21,30,22],[33,22,34,22],[20,20,20,21],[20,22,20,23],[21,20,21,21],[22,20,22,21],[21,22,21,23],[22,22,22,23],[20,18,20,19],[32,25,32,27],[13,19,13,20],[13,12,13,13],[5,14,5,15],[13,14,13,15],[8,12,8,13],[3,10,3,11],[4,10,4,11],[5,10,5,11],[6,10,6,11],[7,10,7,11],[8,10,8,11],[9,10,9,11],[11,10,11,11],[13,10,13,11],[38,18,39,27],[38,7,39,16],[11,12,11,13],[14,2,14,9],[14,12,14,18],[37,2,37,4],[7,4,7,5],[5,8,5,9],[6,8,6,9],[7,8,7,9],[37,11,37,12],[8,4,8,5],[9,4,9,5],[33,11,34,11],[33,12,34,12],[27,8,27,11],[28,9,28,11],[29,10,29,11],[30,10,30,11],[9,8,9,9],[13,8,13,9],[9,12,9,13],[12,19,12,20],[13,16,13,18],[0,22,0,23],[2,21,2,27],[3,24,3,27],[4,24,4,27],[5,24,5,27],[6,24,6,27],[11,21,11,22],[13,21,13,22],[11,24,11,27],[13,24,13,27],[9,21,9,22],[9,24,9,27],[10,24,10,27],[7,21,7,22],[8,21,8,22],[7,24,7,27],[8,24,8,27],[4,21,4,22],[5,21,5,22],[6,21,6,22],[3,21,3,22]]}
[{"$f":"ДИНАМИКА!A1","v":1},null,"МОДЕЛИРОВАНИЕ:",{"$f":"IF(OFFSET(ВОРОНКА!Q26,($A$1-1)*87,0,1,1)=\"\",0,OFFSET(ВОРОНКА!D24,($A$1-1)*87,0,1,1))","v":0},{"$f":"IF(OFFSET(ВОРОНКА!Q43,($A$1-1)*87,0,1,1)=\"\",0,OFFSET(ВОРОНКА!D41,($A$1-1)*87,0,1,1))","v":0},{"$f":"IF(OFFSET(ВОРОНКА!Q60,($A$1-1)*87,0,1,1)=\"\",0,OFFSET(ВОРОНКА!D58,($A$1-1)*87,0,1,1))","v":0},{"$f":"IF(OFFSET(ВОРОНКА!Q77,($A$1-1)*87,0,1,1)=\"\",0,OFFSET(ВОРОНКА!D75,($A$1-1)*87,0,1,1))","v":0},{"$f":"COUNTIF(D1:G1,\">0\")","v":0},null,null,null,null,null,null,null,null,null,null,null,null,null,null,"Метод:",null,null,null,null,null,2,{"$f":"IF($A$2=1,SUM($D$1:$G$1),VLOOKUP($A$1,СПРАВОЧНИК!$A:$N,14,0))","v":0}]
[1,null,{"$f":"IFERROR(IF(OFFSET(ВОРОНКА!Q26,($A$1-2)*87,0,1,1)=\"\",0,OFFSET(ВОРОНКА!D24,($A$1-2)*87,0,1,1)),0)","v":0},{"$f":"OFFSET(ВОРОНКА!D24,($A$1-1)*87,0,1,1)","v":12},{"$f":"OFFSET(ВОРОНКА!D41,($A$1-1)*87,0,1,1)","v":7},{"$f":"OFFSET(ВОРОНКА!D58,($A$1-1)*87,0,1,1)","v":7},{"$f":"OFFSET(ВОРОНКА!D75,($A$1-1)*87,0,1,1)","v":5},null,null,null,null,null,null,null,null,null,null,null,null,null,null,null,null,"Период:",null,null,null,null,false]
[null,null,"Фактические данные месяца:",null,null,null,null,null,null,null,null,null,"Анализ \"Что будет если\"",null,null,null,null,null,null,null,null,"Декомпозиция чистой прибыли",null,null,null,null,null,null,{"$f":"IF(AC2=TRUE,1,0)","v":0},null,null,"прогноз по минимумам",null,null,null,null,null,"прогноз по максимумам"]
[null,null,"Фактор","нед.1","нед.2",null,"нед.3",null,"нед.4",null,"Показатель",null,"Фактор",null,"∆",null,"Как изменится прибыль",null,null,null,null,"Фактор",null,"∆","Значение фактора",null,null,null,null,"сумма за период","прогноз по средним","4 нед.","1 нед.","2 нед.","3 нед.","4 нед.","Итого","4 нед.","1 нед.","2 нед.","3 нед.","4 нед.","Итого"]
[300,null,"Заходов",{"$f":"OFFSET(ВОРОНКА!$Q26,($A$1-1)*87,0,1,1)","v":""},{"$f":"OFFSET(ВОРОНКА!$Q43,($A$1-1)*87,0,1,1)","v":""},null,{"$f":"OFFSET(ВОРОНКА!$Q60,($A$1-1)*87,0,1,1)","v":""},null,{"$f":"OFFSET(ВОРОНКА!$Q77,($A$1-1)*87,0,1,1)","v":""},null,{"$f":"IFERROR(IF($A$2=1,AD5,IF($A$2=2,AE5,IF($A$2=3,AK5,AQ5)))/IF($AC$3=1,$AD$1,1),0)","v":0},null,"Заходов",null,{"$f":"(A5-300)/100","v":0},null,null,null,null,{"$f":"K5*(1+O5)","v":0},null,"Заходов",null,{"$f":"IFERROR(IF(Y5/K5>9999%,\">9999%\",Y5/K5-1),\"\")","v":""},{"$f":"IF($AC$1=1,IF(Y14=\"\",\"\",K5*(Y9/K9)),((Y14/(K14/K5)*(K5/K9)+Y14)/(K14/K5))/IF($AC$3=1,$AD$1,1))","v":{"$error":"#DIV/0!"}},null,null,null,null,{"$f":"OFFSET(ВОРОНКА!$Q9,($A$1-1)*87,0,1,1)","v":""},{"$f":"IFERROR(AD5/SUM($D$1:$G$1)*VLOOKUP($A$1,СПРАВОЧНИК!$A:$V,22,0),\"\")","v":""},{"$f":"IFERROR(OFFSET(ВОРОНКА!$Q26,($A$1-2)*87,0,1,1),\"no value\")","v":"no value"},{"$f":"D5","v":""},{"$f":"AG5*AH6/AG6","v":{"$error":"#VALUE!"}},{"$f":"AH5*AI6/AH6","v":{"$error":"#VALUE!"}},{"$f":"AI5*AJ6/AI6","v":{"$error":"#VALUE!"}},{"$f":"SUM(AG5:AJ5)","v":{"$error":"#VALUE!"}},{"$f":"AF5","v":"no value"},{"$f":"D5","v":""},{"$f":"AM5*AN6/AM6","v":{"$error":"#VALUE!"}},{"$f":"AN5*AO6/AN6","v":{"$error":"#VALUE!"}},{"$f":"AO5*AP6/AO6","v":{"$error":"#VALUE!"}},{"$f":"SUM(AM5:AP5)","v":{"$error":"#VALUE!"}}]
[null,null,"Откликов",{"$f":"OFFSET(ВОРОНКА!$Q27,($A$1-1)*87,0,1,1)","v":""},{"$f":"OFFSET(ВОРОНКА!$Q44,($A$1-1)*87,0,1,1)","v":""},null,{"$f":"OFFSET(ВОРОНКА!$Q61,($A$1-1)*87,0,1,1)","v":""},null,{"$f":"OFFSET(ВОРОНКА!$Q78,($A$1-1)*87,0,1,1)","v":""},null,0,null,"Откликов",null,{"$f":"IFERROR((T6/K6)-1,0)","v":0},null,null,null,null,{"$f":"IF(K5=0,0,T5*(K6/K5))","v":0},null,"Откликов",null,{"$f":"IFERROR(IF(Y6/K6>9999%,\">9999%\",Y6/K6-1),\"\")","v":""},{"$f":"IF($AC$1=1,IF(Y14=\"\",\"\",K6*(Y9/K9)),Y5*(K6/K5))","v":{"$error":"#DIV/0!"}},null,null,null,null,{"$f":"OFFSET(ВОРОНКА!$Q10,($A$1-1)*87,0,1,1)","v":""},{"$f":"IFERROR(AD6/SUM($D$1:$G$1)*VLOOKUP($A$1,СПРАВОЧНИК!$A:$V,22,0),\"\")","v":""},{"$f":"IFERROR(OFFSET(ВОРОНКА!$Q27,($A$1-2)*87,0,1,1),\"no value\")","v":"no value"},{"$f":"D6","v":""},{"$f":"AG6*AH9/AG9","v":{"$error":"#VALUE!"}},{"$f":"AH6*AI9/AH9","v":{"$error":"#VALUE!"}},{"$f":"AI6*AJ9/AI9","v":{"$error":"#VALUE!"}},{"$f":"SUM(AG6:AJ6)","v":{"$error":"#VALUE!"}},{"$f":"AF6","v":"no value"},{"$f":"D6","v":""},{"$f":"AM6*AN9/AM9","v":{"$error":"#VALUE!"}},{"$f":"AN6*AO9/AN9","v":{"$error":"#VALUE!"}},{"$f":"AO6*AP9/AO9","v":{"$error":"#VALUE!"}},{"$f":"SUM(AM6:AP6)","v":{"$error":"#VALUE!"}}]
[null,null,"Продажи",{"$f":"OFFSET(ВОРОНКА!$Q28,($A$1-1)*87,0,1,1)","v":""},{"$f":"OFFSET(ВОРОНКА!$Q45,($A$1-1)*87,0,1,1)","v":""},null,{"$f":"OFFSET(ВОРОНКА!$Q62,($A$1-1)*87,0,1,1)","v":""},null,{"$f":"OFFSET(ВОРОНКА!$Q79,($A$1-1)*87,0,1,1)","v":""},null,0,null,"Продажи",null,{"$f":"IFERROR((T7/K7)-1,0)","v":0},null,null,null,null,{"$f":"IF(K6=0,0,T6*(K7/K6))","v":0},null,"Продажи",null,"",{"$f":"IF($AC$1=1,IF(Y14=\"\",\"\",K7*(Y9/K9)),Y6*(K7/K6))","v":{"$error":"#DIV/0!"}},null,null,null,null,{"$f":"OFFSET(ВОРОНКА!$Q11,($A$1-1)*87,0,1,1)","v":""},{"$f":"IFERROR(AD7/SUM($D$1:$G$1)*VLOOKUP($A$1,СПРАВОЧНИК!$A:$V,22,0),\"\")","v":""},{"$f":"IFERROR(OFFSET(ВОРОНКА!$Q28,($A$1-2)*87,0,1,1),\"no value\")","v":"no value"},"",{"$f":"IF($H$1>=2,E7,MIN(AF7/C2,AG7/D2)*E2)","v":{"$error":"#VALUE!"}},{"$f":"IF($H$1>=3,G7,MIN(AG7/D2,AH7/E2)*F2)","v":{"$error":"#VALUE!"}},{"$f":"IF($H$1>=4,I7,MIN(AH7/E2,AI7/F2)*G2)","v":{"$error":"#VALUE!"}},{"$f":"SUM(AG7:AJ7)","v":{"$error":"#VALUE!"}},"no value","",{"$f":"IF($H$1>=2,E7,MAX(AL7/C2,AM7/D2)*E2)","v":{"$error":"#VALUE!"}},{"$f":"IF($H$1>=3,G7,MAX(AM7/D2,AN7/E2)*F2)","v":{"$error":"#VALUE!"}},{"$f":"IF($H$1>=4,I7,MAX(AN7/E2,AO7/F2)*G2)","v":{"$error":"#VALUE!"}},{"$f":"SUM(AM7:AP7)","v":{"$error":"#VALUE!"}}]
[null,null,"Прибыль, руб.",{"$f":"OFFSET(ВОРОНКА!$Q29,($A$1-1)*87,0,1,1)","v":""},{"$f":"OFFSET(ВОРОНКА!$Q46,($A$1-1)*87,0,1,1)","v":""},null,{"$f":"OFFSET(ВОРОНКА!$Q63,($A$1-1)*87,0,1,1)","v":""},null,{"$f":"OFFSET(ВОРОНКА!$Q80,($A$1-1)*87,0,1,1)","v":""},null,0,null,"Прибыль, руб.",null,{"$f":"IFERROR(T8/K8-1,0)","v":0},null,null,null,null,{"$f":"IFERROR(T7*T12,0)","v":0},null,"Прибыль, руб.",null,"",{"$f":"IF($AC$1=1,IFERROR(Y7*Y12,\"\"),(Y14+K9+K10)/IF($AC$3=1,$AD$1,1))","v":0},null,null,null,null,{"$f":"OFFSET(ВОРОНКА!$Q12,($A$1-1)*87,0,1,1)","v":""},{"$f":"IFERROR(AD8/SUM($D$1:$G$1)*VLOOKUP($A$1,СПРАВОЧНИК!$A:$V,22,0),\"\")","v":""},{"$f":"IFERROR(OFFSET(ВОРОНКА!$Q29,($A$1-2)*87,0,1,1),\"no value\")","v":"no value"},{"$f":"AG7*AG12","v":{"$error":"#VALUE!"}},{"$f":"AH7*AH12","v":{"$error":"#VALUE!"}},{"$f":"AI7*AI12","v":{"$error":"#VALUE!"}},{"$f":"AJ7*AJ12","v":{"$error":"#VALUE!"}},{"$f":"SUM(AG8:AJ8)","v":{"$error":"#VALUE!"}},"no value",{"$f":"AM7*AM12","v":{"$error":"#VALUE!"}},{"$f":"AN7*AN12","v":{"$error":"#VALUE!"}},{"$f":"AO7*AO12","v":{"$error":"#VALUE!"}},{"$f":"AP7*AP12","v":{"$error":"#VALUE!"}},{"$error":"#VALUE!"}]
{"$rows_left_out":32}
{"sheet":"БАЗА КЛИЕНТОВ","index":3,"n_rows":11,"n_cols":16,"rows_kept":11,"cut":false,"hidden":false,"merged":[]}
["Номер заказа","Месяц","Код услуги","Теплота клиента","Первый контакт","ФИО клиента","Канал лидгена","Телефон клиента","E-mail клиента","Адрес клиента","Менеджер №","Последний контакт","Следующий шаг","X","Результат","Комментарии"]
[1,1,3,10,"2013-05-01","Правильный Петр Михайлович","директ",7923151515,"ohlop@mail.ru",null,"Менеджер 1","2013-10-07","2014-01-06","X","Оплатили"]
[2,3,3,10,"2013-05-06","Пупкин Иван Степанович","adwords",null,null,null,"Менеджер 2","2013-05-26","2014-01-31","X","Оплатили"]
[3,4,2,5,"2013-06-10","Иванов Иван Иванович",null,null,null,null,"Менеджер 2","2013-06-27","2014-01-13","X","Подумаю (коммент.)","Нет доставки"]
[4,5,2,2,"2013-06-10","Петров Петр Петрович",null,null,null,null,"Менеджер 3","2013-06-28","2014-01-14","X","Не дозвон.","нет денег"]
[5,5,1,8,"2013-06-10","Сидорв Николай Семенович",null,null,null,null,"Менеджер 3","2013-06-29","2014-01-10","X","Хотят, но (коммент.)","Нет времени оплатить"]
[6,4,2,7,"2013-06-10","Потапов Сергей Юрьевич",null,null,null,null,"Менеджер 1","2013-06-30","2014-01-11","X","Не дозвон."]
[7,5,3,0,"2013-06-10","Барыкин Алектей Алексеевич",null,null,null,null,"Менеджер 2","2013-07-01","2014-01-12",null,"Отказ"]
{"$rows_left_out":4}
{"sheet":"СТАТИСТИКА БАЗЫ","index":4,"n_rows":91,"n_cols":18,"rows_kept":91,"cut":false,"hidden":false,"merged":[[12,1,15,2]]}
[]
[null,"СТАТИСТИКА ПО МЕНЕДЖЕРАМ:"]
[null,null,{"$f":"IF(DAY(C4)<10,\"0\"&DAY(C4),DAY(C4))&\".\"&IF(MONTH(C4)<10,\"0\"&MONTH(C4),MONTH(C4))&\".\"&YEAR(C4)&\"-\"&IF(DAY(C5)<10,\"0\"&DAY(C5),DAY(C5))&\".\"&IF(MONTH(C5)<10,\"0\"&MONTH(C5),MONTH(C5))&\".\"&YEAR(C5)&\" \"&C6","v":"01.01.2013-01.05.2014 Менеджер 2"}]
[null,"Введите дата начала периода:","2013-01-01"]
[null,"Введите дату завершения периода:","2014-05-01"]
[null,"ФИО сотрудника (выбрать из списка):","Менеджер 2"]
[{"$f":"IF(C7=0,#N/A,C7)","v":3},"Количество контактов за период",{"$f":"IFERROR(SUMPRODUCT((list_managers=C$6)*(list_dates>=C$4)*(list_dates<=C$5)*(list_counts=list_counts)),\"\")","v":3}]
[1,"Отказ",{"$f":"IFERROR(SUMPRODUCT((list_managers=C$6)*(list_dates>=C$4)*(list_dates<=C$5)*(list_results=B8)*(list_counts=list_counts)),\"\")","v":1}]
{"$rows_left_out":84}
{"sheet":"СПРАВОЧНИК","index":5,"n_rows":300,"n_cols":36,"rows_kept":300,"cut":false,"hidden":false,"merged":[[44,16,44,17],[45,16,46,17],[47,16,47,17],[32,16,32,17],[33,16,35,17],[157,28,159,43],[162,31,162,39],[164,28,167,43],[170,28,175,43],[98,28,127,43],[128,31,128,39],[130,28,151,43],[76,28,79,43],[80,28,88,43],[96,31,96,39],[23,31,23,39],[25,28,35,43],[54,31,54,39],[56,28,69,43],[74,31,74,39],[8,28,13,43],[14,28,19,43],[6,31,6,39],[0,27,0,44],[2,28,2,42],[4,28,4,43]]}
[1,null,"Заходы - отклики",null,null,"Прибыль, руб.",null,null,"Месяц",null,null,"Январь",1,{"$f":"ВОРОНКА!D7","v":31},null,null,"ФИО менеджера","Комментарий","Результат",null,"Январь",31,null,"Сумма за период",null,null,null,"MANUAL"]
[2,null,"Отклики - продажи",null,null,"Затраты (реклама), руб.",null,null,"Неделя 1",null,null,"Февраль",2,{"$f":"ВОРОНКА!D94","v":28},null,null,"Менеджер 1",null,"Оплатили",null,"Февраль",28,null,"Прогноз по средним"]
[3,null,"Заходы-продажи",null,null,"Прибыль  (- реклама)",null,null,"Неделя 2",null,null,"Март",3,{"$f":"ВОРОНКА!D181","v":31},null,null,"Менеджер 2",null,"Отказ",null,"Март",31,null,"Прогноз по минимумам",null,null,null,null,"ВАЖНО! Не удаляйте этот лист, без него работа файла будет некорректной."]
[4,null,null,null,null,"Чистая прибыль",null,null,"Неделя 3",null,null,"Апрель",4,{"$f":"ВОРОНКА!D268","v":30},null,null,"Менеджер 3",null,"Не дозвон.",null,"Апрель",30,null,"Прогноз по максимумам"]
[5,null,null,null,null,null,null,null,"Неделя 4",null,null,"Май",5,{"$f":"ВОРОНКА!D355","v":31},null,null,null,null,"Подумаю (коммент.)",null,"Май",31,null,null,null,null,null,null,"Воронка продаж 4.0 © – Это инструмент для контроля и моделирования показателей бизнеса."]
[6,null,null,null,null,null,null,null,null,null,null,"Июнь",6,{"$f":"ВОРОНКА!D442","v":30},null,null,null,null,"Хотят, но (коммент.)",null,"Июнь",30]
[7,null,null,null,null,null,null,null,null,null,null,"Июль",7,{"$f":"ВОРОНКА!D529","v":31},null,null,null,null,null,null,null,null,null,null,null,null,null,null,null,null,null,"Периоды"]
[8,null,null,null,null,null,null,null,null,null,null,"Август",8,{"$f":"ВОРОНКА!D616","v":31},null,null,null,null,null,null,"Июль",31]
{"$rows_left_out":292}